BDBM50432581 CHEMBL2347030
SMILES NCCCc1c[nH]c2c(F)cccc12
InChI Key InChIKey=OOYDQQMBWSRGBX-UHFFFAOYSA-N
Data  1 KI  2 IC50
  Tab Delimited (TSV)   2D SDfile   Computed 3D by Vconf -m prep SDfile
Find this compound or compounds like it in BindingDB:
Activity Spreadsheet -- Enzyme Inhibition Constant Data from BindingDB
Found 3 hits for monomerid = 50432581
TargetSodium-dependent serotonin transporter(Homo sapiens (Human))
Universit£
Curated by ChEMBL
LigandPNGBDBM50432581(CHEMBL2347030)
Affinity DataKi:  24nM. Assay description: Inhibition of serotonin reuptake at human SERT expressed in HEK293 cells coexpressing macrophage scavenger receptor
In DepthDetails ArticlePubMed
TargetMyeloperoxidase(Homo sapiens (Human))
Universit£
Curated by ChEMBL
LigandPNGBDBM50432581(CHEMBL2347030)
Affinity DataIC50:  24nM. Assay description: Inhibition of human recombinant MPO-mediated taurine chlorination after 5 mins by microplate assay
In DepthDetails ArticlePubMed
TargetMyeloperoxidase(Homo sapiens (Human))
Universit£
Curated by ChEMBL
LigandPNGBDBM50432581(CHEMBL2347030)
Affinity DataIC50:  26nM. Assay description: Inhibition of human recombinant MPO-mediated LDL oxidation after 5 mins by ELISA
In DepthDetails ArticlePubMed