BDBM50432639 CHEMBL2347376
SMILES OC(=O)C[C@H]1O[C@@H]([C@H](N(CC2CC2)C1=O)c1ccc(Cl)cc1)c1cccc(Cl)c1
InChI Key InChIKey=PLSLYOZGYCPTIL-HMXCVIKNSA-N
Data  3 IC50
  Tab Delimited (TSV)   2D SDfile   Computed 3D by Vconf -m prep SDfile
Find this compound or compounds like it in BindingDB:
Activity Spreadsheet -- Enzyme Inhibition Constant Data from BindingDB
Found 3 hits for monomerid = 50432639
TargetE3 ubiquitin-protein ligase Mdm2(Homo sapiens (Human))
Amgen
Curated by ChEMBL
LigandPNGBDBM50432639(CHEMBL2347376)
Affinity DataIC50:  1.67E+4nM. Assay description: Inhibition of MDM2-induced proliferation of human SJSA1 cells assessed as EdU incorporation by High content screening assay in presence of 10% serum
In DepthDetails ArticlePubMed
TargetE3 ubiquitin-protein ligase Mdm2(Homo sapiens (Human))
Amgen
Curated by ChEMBL
LigandPNGBDBM50432639(CHEMBL2347376)
Affinity DataIC50:  290nM. Assay description: Inhibition of human recombinant GST-thrombin-MDM2 (1 to 188) expressed in Escherichia coli assessed as reduction of MDM2-p53 interaction incubated fo...
In DepthDetails ArticlePubMed
TargetE3 ubiquitin-protein ligase Mdm2(Homo sapiens (Human))
Amgen
Curated by ChEMBL
LigandPNGBDBM50432639(CHEMBL2347376)
Affinity DataIC50:  5.00E+3nM. Assay description: Inhibition of human recombinant GST-thrombin-MDM2 (1 to 188) expressed in Escherichia coli assessed as reduction of MDM2-p53 interaction incubated fo...
In DepthDetails ArticlePubMed