BDBM50432744 CHEMBL2348595
SMILES CCOC(=O)C1CCCCN1S(=O)(=O)c1ccc2[nH]c(=O)sc2c1
InChI Key InChIKey=UGUFHLYZGISNLG-UHFFFAOYSA-N
Data  1 KI
  Tab Delimited (TSV)   2D SDfile   Computed 3D by Vconf -m prep SDfile
Find this compound or compounds like it in BindingDB:
Activity Spreadsheet -- Enzyme Inhibition Constant Data from BindingDB
Found 1 hit for monomerid = 50432744
TargetPeptidyl-prolyl cis-trans isomerase FKBP5(Homo sapiens (Human))
Max Institute Of Psychiatry
Curated by ChEMBL
LigandPNGBDBM50432744(CHEMBL2348595)
Affinity DataKi: >1.00E+5nM. Assay description: Binding affinity to human FKBP51 by competitive fluorescence polarization assay
In DepthDetails ArticlePubMed