BDBM50432763 CHEMBL2348623
SMILES CN[C@@H](C)C(=O)N[C@H]1CN(CC[C@H]2CC[C@H](N2C1=O)C(=O)NC(c1ccccc1)c1ccccc1)C(=O)Nc1ccc(NC(=O)N2CC[C@H]3CC[C@H](N3C(=O)[C@H](C2)NC(=O)[C@H](C)NC)C(=O)NC(c2ccccc2)c2ccccc2)cc1
InChI Key InChIKey=SGWUDLNUDPDRSR-CEQBHCGOSA-N
Data  2 KI  3 IC50
  Tab Delimited (TSV)   2D SDfile   Computed 3D by Vconf -m prep SDfile
Find this compound or compounds like it in BindingDB:
Activity Spreadsheet -- Enzyme Inhibition Constant Data from BindingDB
Found 5 hits for monomerid = 50432763
TargetBaculoviral IAP repeat-containing protein 2(Homo sapiens (Human))
University Of Michigan
Curated by ChEMBL
LigandPNGBDBM50432763(CHEMBL2348623)
Affinity DataKi:  3.70nM. Assay description: Binding affinity to cIAP1 BIR3 domain (unknown origin) after 3 hrs by competitive fluorescence polarization assay in presence of Smac-2F
In DepthDetails ArticlePubMed
TargetBaculoviral IAP repeat-containing protein 3(Homo sapiens (Human))
University Of Michigan
Curated by ChEMBL
LigandPNGBDBM50432763(CHEMBL2348623)
Affinity DataKi:  5.40nM. Assay description: Binding affinity to cIAP2 BIR3 domain (unknown origin) after 3 hrs by competitive fluorescence polarization assay in presence of Smac-2F
In DepthDetails ArticlePubMed
TargetBaculoviral IAP repeat-containing protein 2(Homo sapiens (Human))
University Of Michigan
Curated by ChEMBL
LigandPNGBDBM50432763(CHEMBL2348623)
Affinity DataIC50:  22nM. Assay description: Binding affinity to cIAP1 BIR3 domain (unknown origin) after 3 hrs by competitive fluorescence polarization assay in presence of Smac-2F
In DepthDetails ArticlePubMed
TargetE3 ubiquitin-protein ligase XIAP(Homo sapiens (Human))
University Of Michigan
Curated by ChEMBL
LigandPNGBDBM50432763(CHEMBL2348623)
Affinity DataIC50:  4.20nM. Assay description: Binding affinity to XIAP linker BIR2-BIR3 domain (unknown origin) after 3 hrs by competitive fluorescence polarization assay in presence of Smac-1F
In DepthDetails ArticlePubMed
TargetBaculoviral IAP repeat-containing protein 3(Homo sapiens (Human))
University Of Michigan
Curated by ChEMBL
LigandPNGBDBM50432763(CHEMBL2348623)
Affinity DataIC50:  23nM. Assay description: Binding affinity to cIAP2 BIR3 domain (unknown origin) after 3 hrs by competitive fluorescence polarization assay in presence of Smac-2F
In DepthDetails ArticlePubMed