BDBM50432795 CHEMBL2348819
SMILES CC(Oc1ccc(Cl)c2ccccc12)C(=O)Nc1ccc2oc(nc2c1)-c1ccncc1
InChI Key InChIKey=XQDNYWOUGDXBJB-UHFFFAOYSA-N
Data  3 IC50
  Tab Delimited (TSV)   2D SDfile   Computed 3D by Vconf -m prep SDfile
Find this compound or compounds like it in BindingDB:
Activity Spreadsheet -- Enzyme Inhibition Constant Data from BindingDB
Found 3 hits for monomerid = 50432795
TargetInosine-5'-monophosphate dehydrogenase 2(Homo sapiens (Human))
Brandeis University
Curated by ChEMBL
LigandPNGBDBM50432795(CHEMBL2348819)
Affinity DataIC50: >5.00E+3nM. Assay description: Inhibition of human IMPDH2
In DepthDetails ArticlePubMed
TargetInosine-5'-monophosphate dehydrogenase(Cryptosporidium parvum)
Brandeis University
Curated by ChEMBL
LigandPNGBDBM50432795(CHEMBL2348819)
Affinity DataIC50:  27nM. Assay description: Inhibition of Cryptosporidium parvum N-terminal His6-tagged IMPDH-mediated NADH production expressed in Escherichia coli BL21(DE3) preincubated for 5...
In DepthDetails ArticlePubMed
TargetInosine-5'-monophosphate dehydrogenase(Cryptosporidium parvum)
Brandeis University
Curated by ChEMBL
LigandPNGBDBM50432795(CHEMBL2348819)
Affinity DataIC50:  53nM. Assay description: Inhibition of Cryptosporidium parvum N-terminal His6-tagged IMPDH-mediated NADH production expressed in Escherichia coli BL21(DE3) preincubated for 5...
In DepthDetails ArticlePubMed