BDBM50432806 CHEMBL2376073
SMILES OC(=O)c1cccnc1Sc1nc2ccc(Cl)cc2c(=O)n1-c1ccccc1
InChI Key InChIKey=QAMCHSJRBYKEFC-UHFFFAOYSA-N
Data  1 IC50
  Tab Delimited (TSV)   2D SDfile   Computed 3D by Vconf -m prep SDfile
Find this compound or compounds like it in BindingDB:
Activity Spreadsheet -- Enzyme Inhibition Constant Data from BindingDB
Found 1 hit for monomerid = 50432806
TargetDihydrofolate reductase(Bos taurus (Cattle))
King Saud University
Curated by ChEMBL
LigandPNGBDBM50432806(CHEMBL2376073)
Affinity DataIC50:  8.00E+3nM. Assay description: Inhibition of bovine DHFR after 2 mins by spectrophotometry
In DepthDetails ArticlePubMed