BDBM50432809 CHEMBL2376070
SMILES COc1cc2nc(Sc3cnc(N)s3)n(Cc3ccccc3)c(=O)c2cc1OC
InChI Key InChIKey=AXYZTKHWNCICNT-UHFFFAOYSA-N
Data  1 IC50
  Tab Delimited (TSV)   2D SDfile   Computed 3D by Vconf -m prep SDfile
Find this compound or compounds like it in BindingDB:
Activity Spreadsheet -- Enzyme Inhibition Constant Data from BindingDB
Found 1 hit for monomerid = 50432809
TargetDihydrofolate reductase(Bos taurus (Cattle))
King Saud University
Curated by ChEMBL
LigandPNGBDBM50432809(CHEMBL2376070)
Affinity DataIC50:  3.00E+3nM. Assay description: Inhibition of bovine DHFR after 2 mins by spectrophotometry
In DepthDetails ArticlePubMed