BDBM50432815 CHEMBL2376082
SMILES CCOC(=O)c1nc(N)sc1Sc1nc2cc(OC)c(OC)cc2c(=O)n1Cc1ccccc1
InChI Key InChIKey=GDXXUHGTFHHIGR-UHFFFAOYSA-N
Data  1 IC50
  Tab Delimited (TSV)   2D SDfile   Computed 3D by Vconf -m prep SDfile
Find this compound or compounds like it in BindingDB:
Activity Spreadsheet -- Enzyme Inhibition Constant Data from BindingDB
Found 1 hit for monomerid = 50432815
TargetDihydrofolate reductase(Bos taurus (Cattle))
King Saud University
Curated by ChEMBL
LigandPNGBDBM50432815(CHEMBL2376082)
Affinity DataIC50:  2.00E+3nM. Assay description: Inhibition of bovine DHFR after 2 mins by spectrophotometry
In DepthDetails ArticlePubMed