BDBM50432851 CHEMBL2376216
SMILES CN(C)C(=O)n1nnc(n1)-c1ccc(Oc2ccc(Cl)cc2)cc1
InChI Key InChIKey=DMGQNYGWEDSUQG-UHFFFAOYSA-N
Data  2 IC50
  Tab Delimited (TSV)   2D SDfile   Computed 3D by Vconf -m prep SDfile
Find this compound or compounds like it in BindingDB:
Activity Spreadsheet -- Enzyme Inhibition Constant Data from BindingDB
Found 2 hits for monomerid = 50432851
TargetFatty-acid amide hydrolase 1 [30-579](Rattus norvegicus (rat))
University Of M£Nster
Curated by ChEMBL
LigandPNGBDBM50432851(CHEMBL2376216)
Affinity DataIC50:  16nM. Assay description: Inhibition of FAAH in Sprague-Dawley rat brain microsomes assessed as N-(2-hydroxyethyl)-4-pyren-1-ylbutanamide conversion to 4-pyren-1-ylbutanoic ac...
In DepthDetails ArticlePubMed
TargetMonoglyceride lipase(Homo sapiens (Human))
University Of M£Nster
Curated by ChEMBL
LigandPNGBDBM50432851(CHEMBL2376216)
Affinity DataIC50:  37nM. Assay description: Inhibition of human recombinant MAGL-mediated 1,3-dihydroxypropan-1-yl 4-pyren-1-ylbutanoate conversion to 4-pyren-1-ylbutanoic acid preincubated for...
In DepthDetails ArticlePubMed