BDBM50433093 CHEMBL2376930
SMILES Clc1ccccc1Nc1ccc2n(ncc2c1)-c1cc(ccn1)C(=O)NCCN1CCOCC1
InChI Key InChIKey=JAQYMLHJXIRKSU-UHFFFAOYSA-N
Data  4 IC50  1 Kd
  Tab Delimited (TSV)   2D SDfile   Computed 3D by Vconf -m prep SDfile
Find this compound or compounds like it in BindingDB:
Activity Spreadsheet -- Enzyme Inhibition Constant Data from BindingDB
Found 5 hits for monomerid = 50433093
TargetMitogen-activated protein kinase 10(Rattus norvegicus)
Eberhard Karls Universit£T T£Bingen
Curated by ChEMBL
LigandPNGBDBM50433093(CHEMBL2376930)
Affinity DataIC50:  5.30E+3nM. Assay description: Inhibition of JNK3-mediated c-jun phosphorylation in rat INS1 cells
In DepthDetails ArticlePubMed
TargetMast/stem cell growth factor receptor Kit(Homo sapiens (Human))
Eberhard Karls Universit£T T£Bingen
Curated by ChEMBL
LigandPNGBDBM50433093(CHEMBL2376930)
Affinity DataKd: <1.00E+3nM. Assay description: Inhibition of KIT (unknown origin)
In DepthDetails ArticlePubMed
TargetMitogen-activated protein kinase 10(Rattus norvegicus)
Eberhard Karls Universit£T T£Bingen
Curated by ChEMBL
LigandPNGBDBM50433093(CHEMBL2376930)
Affinity DataIC50:  5.30E+3nM. Assay description: Inhibition of JNK3-mediated c-Jun phosphorylation in rat INS-1 cells after 3 hrs by ELISA
In DepthDetails ArticlePubMed
TargetMitogen-activated protein kinase 10(Homo sapiens (Human))
Eberhard Karls Universit£T T£Bingen
Curated by ChEMBL
LigandPNGBDBM50433093(CHEMBL2376930)
Affinity DataIC50:  120nM. Assay description: Inhibition of JNK3 (unknown origin) by time-resolved fluorescence assay
In DepthDetails ArticlePubMed
TargetMitogen-activated protein kinase 8(Homo sapiens (Human))
Eberhard Karls Universit£T T£Bingen
Curated by ChEMBL
LigandPNGBDBM50433093(CHEMBL2376930)
Affinity DataIC50:  2.30E+3nM. Assay description: Inhibition of JNK1 (unknown origin) by time-resolved fluorescence assay
In DepthDetails ArticlePubMed