BDBM50433131 CHEMBL2377613
SMILES Fc1ccc(nc1)N1CCN(CC(=O)c2c[nH]c3ccccc23)CC1
InChI Key InChIKey=YTPAUOLXBLRDNL-UHFFFAOYSA-N
Data  2 IC50
  Tab Delimited (TSV)   2D SDfile   Computed 3D by Vconf -m prep SDfile
Find this compound or compounds like it in BindingDB:
Activity Spreadsheet -- Enzyme Inhibition Constant Data from BindingDB
Found 2 hits for monomerid = 50433131
TargetLong-chain fatty acid transport protein 1(Homo sapiens (Human))
Daiichi Sankyo
Curated by ChEMBL
LigandPNGBDBM50433131(CHEMBL2377613)
Affinity DataIC50: >1.00E+3nM. Assay description: Inhibition of human FLAG-tagged FATP1-mediated [1-14C] oleic acid conversion to [1-14C] oleoyl-CoA after 20 mins by scintillation counting analysis
In DepthDetails ArticlePubMed
TargetLong-chain fatty acid transport protein 1(Mus musculus)
Daiichi Sankyo
Curated by ChEMBL
LigandPNGBDBM50433131(CHEMBL2377613)
Affinity DataIC50: >1.00E+4nM. Assay description: Inhibition of mouse FLAG-tagged FATP1-mediated [1-14C] oleic acid conversion to [1-14C] oleoyl-CoA after 20 mins by scintillation counting analysis
In DepthDetails ArticlePubMed