BDBM50433138 CHEMBL2377620
SMILES CN(C(=O)CN1CCN(CC1)c1ccc(F)cn1)c1nc2CCCCc2s1
InChI Key InChIKey=ABIWKFCTLVJCKN-UHFFFAOYSA-N
Data  2 IC50
  Tab Delimited (TSV)   2D SDfile   Computed 3D by Vconf -m prep SDfile
Find this compound or compounds like it in BindingDB:
Activity Spreadsheet -- Enzyme Inhibition Constant Data from BindingDB
Found 2 hits for monomerid = 50433138
TargetLong-chain fatty acid transport protein 1(Homo sapiens (Human))
Daiichi Sankyo
Curated by ChEMBL
LigandPNGBDBM50433138(CHEMBL2377620)
Affinity DataIC50:  41nM. Assay description: Inhibition of human FLAG-tagged FATP1-mediated [1-14C] oleic acid conversion to [1-14C] oleoyl-CoA after 20 mins by scintillation counting analysis
In DepthDetails ArticlePubMed
TargetLong-chain fatty acid transport protein 1(Mus musculus)
Daiichi Sankyo
Curated by ChEMBL
LigandPNGBDBM50433138(CHEMBL2377620)
Affinity DataIC50:  620nM. Assay description: Inhibition of mouse FLAG-tagged FATP1-mediated [1-14C] oleic acid conversion to [1-14C] oleoyl-CoA after 20 mins by scintillation counting analysis
In DepthDetails ArticlePubMed