BDBM50433164 CHEMBL2377803
SMILES COc1ccc(NS(=O)(=O)C(Cc2ccc(NC(=O)C(O)=O)cc2)c2nc3ccccc3o2)cc1
InChI Key InChIKey=GWJYQDLLRWEELL-UHFFFAOYSA-N
Data  2 KI
  Tab Delimited (TSV)   2D SDfile   Computed 3D by Vconf -m prep SDfile
Find this compound or compounds like it in BindingDB:
Activity Spreadsheet -- Enzyme Inhibition Constant Data from BindingDB
Found 2 hits for monomerid = 50433164
TargetTyrosine-protein phosphatase non-receptor type 1(Homo sapiens (Human))
Aurigene Discovery Technologies
Curated by ChEMBL
LigandPNGBDBM50433164(CHEMBL2377803)
Affinity DataKi:  6.88E+4nM. Assay description: Inhibition of PTP1B (unknown origin)-mediated pNPP hydrolysis to 4-nitrophenol after 60 mins by spectrophotometric analysis
In DepthDetails ArticlePubMed
TargetTyrosine-protein phosphatase non-receptor type 2(Homo sapiens (Human))
Aurigene Discovery Technologies
Curated by ChEMBL
LigandPNGBDBM50433164(CHEMBL2377803)
Affinity DataKi:  1.34E+5nM. Assay description: Inhibition of TCPTP (unknown origin)
In DepthDetails ArticlePubMed