BDBM50433239 CHEMBL2376158
SMILES C[C@@H](NC(=O)c1c[nH]c2ncc(nc12)-c1ncn2cc(F)cc(F)c12)C(=O)N1CC(C1)C#N
InChI Key InChIKey=XVOQZCVSDBIDJD-SNVBAGLBSA-N
Data  6 IC50
  Tab Delimited (TSV)   2D SDfile   Computed 3D by Vconf -m prep SDfile
Find this compound or compounds like it in BindingDB:
Activity Spreadsheet -- Enzyme Inhibition Constant Data from BindingDB
Found 6 hits for monomerid = 50433239
TargetTyrosine-protein kinase JAK3(Homo sapiens (Human))
F. Hoffmann-La Roche
Curated by ChEMBL
LigandPNGBDBM50433239(CHEMBL2376158)
Affinity DataIC50:  1nM. Assay description: Inhibition of JAK3 (unknown origin) using [33gammaP]ATP and Biotin-KAIETDKEYYTVKD as substrate incubated for 10 mins prior to substrate addition meas...
In DepthDetails ArticlePubMed
TargetTyrosine-protein kinase JAK1/JAK2(Homo sapiens (Human))
F. Hoffmann-La Roche
Curated by ChEMBL
LigandPNGBDBM50433239(CHEMBL2376158)
Affinity DataIC50:  1.29E+4nM. Assay description: Inhibition of JAK2/1 in human T cells expressing CD3 assessed as inhibition of IFNgamma-stimulated STAT1 phosphorylation
In DepthDetails ArticlePubMed
TargetTyrosine-protein kinase JAK2(Homo sapiens (Human))
F. Hoffmann-La Roche
Curated by ChEMBL
LigandPNGBDBM50433239(CHEMBL2376158)
Affinity DataIC50:  37nM. Assay description: Inhibition of JAK2 (unknown origin) using [33gammaP]ATP and Biotin-KAIETDKEYYTVKD as substrate incubated for 10 mins prior to substrate addition meas...
In DepthDetails ArticlePubMed
TargetJAK3/JAK1(Homo sapiens (Human))
F. Hoffmann-La Roche
Curated by ChEMBL
LigandPNGBDBM50433239(CHEMBL2376158)
Affinity DataIC50:  1.29E+3nM. Assay description: Inhibition of JAK3/1 in human T cells expressing CD3 assessed as inhibition of IL2-stimulated STAT5a phosphorylation
In DepthDetails ArticlePubMed
TargetTyrosine-protein kinase JAK1(Homo sapiens (Human))
F. Hoffmann-La Roche
Curated by ChEMBL
LigandPNGBDBM50433239(CHEMBL2376158)
Affinity DataIC50:  73nM. Assay description: Inhibition of JAK1 (unknown origin) using [33gammaP]ATP and Biotin-KAIETDKEYYTVKD as substrate incubated for 10 mins prior to substrate addition meas...
In DepthDetails ArticlePubMed
TargetTyrosine-protein kinase JAK2(Homo sapiens (Human))
F. Hoffmann-La Roche
Curated by ChEMBL
LigandPNGBDBM50433239(CHEMBL2376158)
Affinity DataIC50:  1.08E+4nM. Assay description: Inhibition of JAK2 in human monocytes expressing CD14 assessed as inhibition of GM-CSF-stimulated STAT5a phosphorylation
In DepthDetails ArticlePubMed