BDBM50433258 CHEMBL2376166
SMILES [#6]-[#7](-[#6])S(=O)(=O)c1ccc(-[#6]-c2sc(-[#7]-[#6](-[#6])=O)nc2-[#6]-[#6]-c2ccc(cc2)\[#7]=[#6](\[#7])-[#7])cc1
InChI Key InChIKey=ZHSWODVFGUHKOB-UHFFFAOYSA-N
Data  2 IC50
  Tab Delimited (TSV)   2D SDfile   Computed 3D by Vconf -m prep SDfile
Find this compound or compounds like it in BindingDB:
Activity Spreadsheet -- Enzyme Inhibition Constant Data from BindingDB
Found 2 hits for monomerid = 50433258
TargetMembrane primary amine oxidase(Homo sapiens (Human))
Astellas Pharma
Curated by ChEMBL
LigandPNGBDBM50433258(CHEMBL2376166)
Affinity DataIC50:  150nM. Assay description: Inhibition of human VAP1 expressed in CHO cells using [14C]-benzylamine as substrate incubated for 30 mins prior to substrate addition measured after...
In DepthDetails ArticlePubMed
TargetMembrane primary amine oxidase(Rattus norvegicus (Rat))
Astellas Pharma
Curated by ChEMBL
LigandPNGBDBM50433258(CHEMBL2376166)
Affinity DataIC50:  50nM. Assay description: Inhibition of rat VAP1 expressed in CHO cells using [14C]-benzylamine as substrate incubated for 30 mins prior to substrate addition measured after 1...
In DepthDetails ArticlePubMed