BDBM50433261 CHEMBL2376164
SMILES [#6]-[#6](=O)-[#7]-c1nc(-[#6]-[#6]-c2ccc(cc2)\[#7]=[#6](\[#7])-[#7])c(-[#6]-[#6]-c2ccc(cc2)S([#6])(=O)=O)s1
InChI Key InChIKey=ICLRYNZLAIZAKF-UHFFFAOYSA-N
Data  2 IC50
  Tab Delimited (TSV)   2D SDfile   Computed 3D by Vconf -m prep SDfile
Find this compound or compounds like it in BindingDB:
Activity Spreadsheet -- Enzyme Inhibition Constant Data from BindingDB
Found 2 hits for monomerid = 50433261
TargetMembrane primary amine oxidase(Homo sapiens (Human))
Astellas Pharma
Curated by ChEMBL
LigandPNGBDBM50433261(CHEMBL2376164)
Affinity DataIC50:  160nM. Assay description: Inhibition of human VAP1 expressed in CHO cells using [14C]-benzylamine as substrate incubated for 30 mins prior to substrate addition measured after...
In DepthDetails ArticlePubMed
TargetMembrane primary amine oxidase(Rattus norvegicus (Rat))
Astellas Pharma
Curated by ChEMBL
LigandPNGBDBM50433261(CHEMBL2376164)
Affinity DataIC50:  92nM. Assay description: Inhibition of rat VAP1 expressed in CHO cells using [14C]-benzylamine as substrate incubated for 30 mins prior to substrate addition measured after 1...
In DepthDetails ArticlePubMed