BDBM50433426 CHEMBL2380782
SMILES COC(=O)C1=C/C=C\[C@@]2(C)O[C@@H]2[C@H]2OC(=O)C(=C)[C@@H]2[C@H](OC(=O)[C@]2(C)O[C@@H]2C)[C@H]\1OC(C)=O
InChI Key InChIKey=OHHDXIRXYVPFMP-OTLBAFLESA-N
Data  2 IC50
  Tab Delimited (TSV)   2D SDfile   Computed 3D by Vconf -m prep SDfile
Find this compound or compounds like it in BindingDB:
Activity Spreadsheet -- Enzyme Inhibition Constant Data from BindingDB
Found 2 hits for monomerid = 50433426
TargetTranscriptional activator Myb(Gallus gallus)
University Of M£Nster
Curated by ChEMBL
LigandPNGBDBM50433426(CHEMBL2380782)
Affinity DataIC50:  8.60E+3nM. Assay description: Inhibition of c-Myb-induced mim-1 gene expression in doxycyclin-treated chicken HD11 cells after 24 hrs by GFP assay
In DepthDetails ArticlePubMed
TargetTranscriptional activator Myb(Gallus gallus)
University Of M£Nster
Curated by ChEMBL
LigandPNGBDBM50433426(CHEMBL2380782)
Affinity DataIC50:  8.61E+3nM. Assay description: Inhibition of c-Myb-induced mim-1 gene expression in doxycyclin-treated chicken HD11 cells after 24 hrs by GFP assay
In DepthDetails ArticlePubMed