BDBM50433562 CHEMBL1818538::Nutlin-1
SMILES COc1ccc(C2=NC(C(N2C(=O)N2CCN(CC2)C(C)=O)c2ccc(Cl)cc2)c2ccc(Cl)cc2)c(OC(C)C)c1
InChI Key InChIKey=IYDMGGPKSVWQRT-UHFFFAOYSA-N
Data  2 IC50
  Tab Delimited (TSV)   2D SDfile   Computed 3D by Vconf -m prep SDfile
Find this compound or compounds like it in BindingDB:
Activity Spreadsheet -- Enzyme Inhibition Constant Data from BindingDB
Found 2 hits for monomerid = 50433562
TargetE3 ubiquitin-protein ligase Mdm2(Homo sapiens (Human))
Jss Academy Of Higher Education And Research
Curated by ChEMBL
LigandPNGBDBM50433562(CHEMBL1818538 | Nutlin-1)
Affinity DataIC50:  260nM. Assay description: Inhibition of recombinant p53 protein binding to recombinant human MDM2 by surface plasmon resonance method
In DepthDetails ArticlePubMed
TargetE3 ubiquitin-protein ligase Mdm2(Homo sapiens (Human))
Jss Academy Of Higher Education And Research
Curated by ChEMBL
LigandPNGBDBM50433562(CHEMBL1818538 | Nutlin-1)
Affinity DataIC50:  100nM. Assay description: Antagonist activity at human GST-tagged MDM2 assessed as inhibition of binding to full length p53
In DepthDetails ArticlePubMed