BDBM50433592 CHEMBL2381831
SMILES OC(=O)CCNC(=O)c1ccc(cc1)C(Oc1ccc(cc1)-n1cc(cn1)C(F)(F)F)C1CCC1
InChI Key InChIKey=CNRRLGBENJFDLP-UHFFFAOYSA-N
Data  1 KI
  Tab Delimited (TSV)   2D SDfile   Computed 3D by Vconf -m prep SDfile
Find this compound or compounds like it in BindingDB:
Activity Spreadsheet -- Enzyme Inhibition Constant Data from BindingDB
Found 1 hit for monomerid = 50433592
TargetGlucagon receptor(Homo sapiens (Human))
Pfizer
Curated by ChEMBL
LigandPNGBDBM50433592(CHEMBL2381831)
Affinity DataKi:  700nM. Assay description: Displacement of [125I]-glucagon-cex from human glucagon receptor by cell based assay in presence of 0.2% bovine serum albumin
In DepthDetails ArticlePubMed