BDBM50433603 CHEMBL2381987
SMILES C[C@H](Nc1nc(Nc2cc(C)n[nH]2)nc(N2CCN(C)CC2)c1F)c1ccc(F)cn1
InChI Key InChIKey=LIBIKEQDGUDLLZ-ZDUSSCGKSA-N
Data  2 IC50
  Tab Delimited (TSV)   2D SDfile   Computed 3D by Vconf -m prep SDfile
Find this compound or compounds like it in BindingDB:
Activity Spreadsheet -- Enzyme Inhibition Constant Data from BindingDB
Found 2 hits for monomerid = 50433603
TargetTyrosine-protein kinase JAK2(Homo sapiens (Human))
Astrazeneca
Curated by ChEMBL
LigandPNGBDBM50433603(CHEMBL2381987)
Affinity DataIC50:  17nM. Assay description: Inhibition of JAK2 (unknown origin) using biotinylated TYK2 peptide as substrate after 60 mins
In DepthDetails ArticlePubMed
TargetTyrosine-protein kinase JAK3(Homo sapiens (Human))
Astrazeneca
Curated by ChEMBL
LigandPNGBDBM50433603(CHEMBL2381987)
Affinity DataIC50:  15nM. Assay description: Inhibition of JAK3 (unknown origin) using biotinylated poly-EY peptide as substrate after 60 mins by HTRF assay
In DepthDetails ArticlePubMed