BDBM50433848 CHEMBL2382397
SMILES Cc1ccc(NC(=O)CSc2nc(-c3ccc(Cl)cc3)c(C#N)c(=O)[nH]2)cc1Cl
InChI Key InChIKey=FMHBZBTWXBKNSS-UHFFFAOYSA-N
Data  2 IC50  1 Kd
  Tab Delimited (TSV)   2D SDfile   Computed 3D by Vconf -m prep SDfile
Find this compound or compounds like it in BindingDB:
Activity Spreadsheet -- Enzyme Inhibition Constant Data from BindingDB
Found 3 hits for monomerid = 50433848
TargetL-lactate dehydrogenase A chain(Homo sapiens (Human))
Genentech
Curated by ChEMBL
LigandPNGBDBM50433848(CHEMBL2382397)
Affinity DataIC50:  2.76E+4nM. Assay description: Inhibition of human recombinant carboxy-terminal his-tagged LDHA (1 to 331) expressed in Escherichia coli using pyruvate as substrate after 10 mins b...
In DepthDetails ArticlePubMed
TargetL-lactate dehydrogenase A chain(Homo sapiens (Human))
Genentech
Curated by ChEMBL
LigandPNGBDBM50433848(CHEMBL2382397)
Affinity DataKd:  4.66E+5nM. Assay description: Binding affinity to human recombinant carboxy-terminal avi-tagged LDHA (1 to 331) expressed in Escherichia coli by surface plasmon resonance analysis...
In DepthDetails ArticlePubMed
TargetL-lactate dehydrogenase B chain(Homo sapiens (Human))
Genentech
Curated by ChEMBL
LigandPNGBDBM50433848(CHEMBL2382397)
Affinity DataIC50:  9.30E+4nM. Assay description: Inhibition of human recombinant carboxy-terminal his-tagged LDHB (1 to 333) expressed in insect cells using pyruvate as substrate after 10 mins by UV...
In DepthDetails ArticlePubMed