BDBM50433933 CHEMBL2380761
SMILES NS(=O)(=O)c1cccc2C(=O)C(Nc3cccnc3)=CC(=O)c12
InChI Key InChIKey=GSGMKINCHGAOPK-UHFFFAOYSA-N
Data  1 KI
  Tab Delimited (TSV)   2D SDfile   Computed 3D by Vconf -m prep SDfile
Find this compound or compounds like it in BindingDB:
Activity Spreadsheet -- Enzyme Inhibition Constant Data from BindingDB
Found 1 hit for monomerid = 50433933
TargetSignal transducer and activator of transcription 3(Homo sapiens (Human))
The Ohio State University
Curated by ChEMBL
LigandPNGBDBM50433933(CHEMBL2380761)
Affinity DataKi:  2.50E+3nM. Assay description: Inhibition of 5-carboxyfluorescein labeled phosphopeptide binding to STAT3 SH2 domain (unknown origin) incubated for 60 mins prior to 5-carboxyfluore...
In DepthDetails ArticlePubMed