BDBM50434216 CHEMBL2385480
SMILES ONC(=O)CNS(=O)(=O)CCc1ccccc1
InChI Key InChIKey=CWDYQHCEZVYJNX-UHFFFAOYSA-N
Data  2 KI
PDB links: 1 PDB ID matches this monomer.
  Tab Delimited (TSV)   2D SDfile   Computed 3D by Vconf -m prep SDfile
Find this compound or compounds like it in BindingDB:
Activity Spreadsheet -- Enzyme Inhibition Constant Data from BindingDB
Found 2 hits for monomerid = 50434216
TargetMacrophage metalloelastase(Homo sapiens (Human))
University Of Florence
Curated by ChEMBL
LigandPNGBDBM50434216(CHEMBL2385480)
Affinity DataKi:  23nM. Assay description: Inhibition of MMP12 (unknown origin)-mediated Mca-Pro-Leu-Gly-Leu-Dpa-Ala-Arg-NH2 by fluorimetric assay
TargetMatrilysin(Homo sapiens (Human))
University Of Florence
Curated by ChEMBL
LigandPNGBDBM50434216(CHEMBL2385480)
Affinity DataKi:  1.07E+4nM. Assay description: Inhibition of MMP7 (unknown origin)-mediated Mca-Pro-Leu-Gly-Leu-Dpa-Ala-Arg-NH2 by fluorimetric assay
In DepthDetails ArticlePubMed