BDBM50434281 CHEMBL2386167
SMILES CCOc1cc(ccc1C1=N[C@](C)([C@H](N1C(=O)N1CCN(CCCS(C)(=O)=O)CC1)c1ccc(Cl)cc1)c1ccc(Cl)cc1)C(C)(C)C
InChI Key InChIKey=HJAIBUOZTNJPKT-GOJCVTOHSA-N
Data  1 IC50
  Tab Delimited (TSV)   2D SDfile   Computed 3D by Vconf -m prep SDfile
Find this compound or compounds like it in BindingDB:
Activity Spreadsheet -- Enzyme Inhibition Constant Data from BindingDB
Found 1 hit for monomerid = 50434281
TargetE3 ubiquitin-protein ligase Mdm2(Homo sapiens (Human))
Roche Research Center
Curated by ChEMBL
LigandPNGBDBM50434281(CHEMBL2386167)
Affinity DataIC50:  232nM. Assay description: Inhibition of N-terminal human recombinant MDM2 assessed as inhibition of protein interaction with p53 by HTRF assay
In DepthDetails ArticlePubMed