BDBM50434292 CHEMBL2386169
SMILES CCOc1cc(ccc1C1=N[C@@](C)(c2ccc(Cl)cc2)[C@](C)(N1C(=O)N1CCNCC1)c1ccc(Cl)cc1)C(C)(C)C
InChI Key InChIKey=HPHUDNTXCKTLNK-SZAHLOSFSA-N
Data  1 IC50
  Tab Delimited (TSV)   2D SDfile   Computed 3D by Vconf -m prep SDfile
Find this compound or compounds like it in BindingDB:
Activity Spreadsheet -- Enzyme Inhibition Constant Data from BindingDB
Found 1 hit for monomerid = 50434292
TargetE3 ubiquitin-protein ligase Mdm2(Homo sapiens (Human))
Roche Research Center
Curated by ChEMBL
LigandPNGBDBM50434292(CHEMBL2386169)
Affinity DataIC50:  30nM. Assay description: Inhibition of N-terminal human recombinant MDM2 assessed as inhibition of protein interaction with p53 by HTRF assay
In DepthDetails ArticlePubMed