BDBM50434313 CHEMBL2386571
SMILES CN(C)C(=O)[C@H]1C[C@@H]1c1ccc(cc1)-c1ncn(C)c1Sc1ccc(Cl)cn1
InChI Key InChIKey=WRBFPGYDKJBYBI-SJORKVTESA-N
Data  2 IC50  2 Kd
  Tab Delimited (TSV)   2D SDfile   Computed 3D by Vconf -m prep SDfile
Find this compound or compounds like it in BindingDB:
Activity Spreadsheet -- Enzyme Inhibition Constant Data from BindingDB
Found 4 hits for monomerid = 50434313
TargetFatty-acid amide hydrolase 1(Homo sapiens (Human))
Merck Research Laboratories
Curated by ChEMBL
LigandPNGBDBM50434313(CHEMBL2386571)
Affinity DataKd:  0.800nM. Assay description: Binding affinity to FAAH in human cortical homogenates
In DepthDetails ArticlePubMed
TargetFatty-acid amide hydrolase 1(Homo sapiens (Human))
Merck Research Laboratories
Curated by ChEMBL
LigandPNGBDBM50434313(CHEMBL2386571)
Affinity DataIC50:  1nM. Assay description: Inhibition of human FAAH expressed in CHO cell lysates assessed as arachidonyl-7-amino-4-methylcoumarin amide hydrolysis to 7-amino 4-methyl coumarin...
In DepthDetails ArticlePubMed
TargetFatty-acid amide hydrolase 1 [30-579](Rattus norvegicus (rat))
Merck Research Laboratories
Curated by ChEMBL
LigandPNGBDBM50434313(CHEMBL2386571)
Affinity DataIC50:  1.70nM. Assay description: Inhibition of rat FAAH expressed in CHO cell lysates assessed as arachidonyl-7-amino-4-methylcoumarin amide hydrolysis to 7-amino 4-methyl coumarin p...
In DepthDetails ArticlePubMed
TargetFatty-acid amide hydrolase 1 [30-579](Rattus norvegicus (rat))
Merck Research Laboratories
Curated by ChEMBL
LigandPNGBDBM50434313(CHEMBL2386571)
Affinity DataKd:  0.600nM. Assay description: Binding affinity to FAAH in rat cortical homogenates
In DepthDetails ArticlePubMed