BDBM50434558 CHEMBL2386003
SMILES O=C1C[NH2+][B-](O1)(c1ccccc1)c1ccccc1
InChI Key InChIKey=DNSLODXLJMGOJL-UHFFFAOYSA-N
Data  2 IC50
  Tab Delimited (TSV)   2D SDfile   Computed 3D by Vconf -m prep SDfile
Find this compound or compounds like it in BindingDB:
Activity Spreadsheet -- Enzyme Inhibition Constant Data from BindingDB
Found 2 hits for monomerid = 50434558
TargetTransient receptor potential cation channel subfamily V member 6(Homo sapiens (Human))
University Of Bern
Curated by ChEMBL
LigandPNGBDBM50434558(CHEMBL2386003)
Affinity DataIC50:  1.29E+4nM. Assay description: Inhibition of human TRPV6 transfected in HEK293 cells assessed as inhibition of Ca2+ influx after 5 mins by FLIPR assay
In DepthDetails ArticlePubMed
TargetTransient receptor potential cation channel subfamily V member 6(Homo sapiens (Human))
University Of Bern
Curated by ChEMBL
LigandPNGBDBM50434558(CHEMBL2386003)
Affinity DataIC50:  3.06E+4nM. Assay description: Inhibition of human TRPV6 transfected in HEK293 cells assessed as inhibition of Cd2+ influx after 5 mins by FLIPR assay
In DepthDetails ArticlePubMed