BDBM50434642 CHEMBL2387200
SMILES CC1CC(=O)N(C2CCN(CC2)C2CCCCCCC2)c2ccccc12
InChI Key InChIKey=OOLFHBYKMZMHBX-UHFFFAOYSA-N
Data  1 KI  1 EC50
  Tab Delimited (TSV)   2D SDfile   Computed 3D by Vconf -m prep SDfile
Find this compound or compounds like it in BindingDB:
Activity Spreadsheet -- Enzyme Inhibition Constant Data from BindingDB
Found 2 hits for monomerid = 50434642
TargetNociceptin receptor(Homo sapiens (Human))
Astraea Therapeutics
Curated by ChEMBL
LigandPNGBDBM50434642(CHEMBL2387200)
Affinity DataKi:  40nM. Assay description: Displacement of [3H] N/OFQ from human nociceptin receptor transfected in CHO cells
In DepthDetails ArticlePubMed
TargetNociceptin receptor(Homo sapiens (Human))
Astraea Therapeutics
Curated by ChEMBL
LigandPNGBDBM50434642(CHEMBL2387200)
Affinity DataEC50:  95nM. Assay description: Agonist activity at human nociceptin receptor transfected in CHO cells assessed as stimulation of [35S]GTPgammaS binding by liquid scintillation coun...
In DepthDetails ArticlePubMed