BDBM50434743 CHEMBL2385370
SMILES C[C@@H]1CN(Cc2ccccc2)[C@H](Cc2ccccc2)CN1S(=O)(=O)c1ccc(cc1)C(F)(F)F
InChI Key InChIKey=YGRPGAKUWZSKER-HYBUGGRVSA-N
Data  1 IC50
  Tab Delimited (TSV)   2D SDfile   Computed 3D by Vconf -m prep SDfile
Find this compound or compounds like it in BindingDB:
Activity Spreadsheet -- Enzyme Inhibition Constant Data from BindingDB
Found 1 hit for monomerid = 50434743
TargetVoltage-dependent N-type calcium channel subunit alpha-1B(Rattus norvegicus (Rat))
University Of British Columbia
Curated by ChEMBL
LigandPNGBDBM50434743(CHEMBL2385370)
Affinity DataIC50:  1.00E+4nM. Assay description: Inhibition of rat brain Cav2.2 N-type channel expressed in HEK cells after 20 mins by FLIPR assay
In DepthDetails ArticlePubMed