BDBM50434758 CHEMBL2385585
SMILES C1CN(CCO1)c1ccc(cc1)-c1cnc2c(cnn2c1)-c1csc2ccccc12
InChI Key InChIKey=BRTTWVQRKMPQGY-UHFFFAOYSA-N
Data  1 IC50
  Tab Delimited (TSV)   2D SDfile   Computed 3D by Vconf -m prep SDfile
Find this compound or compounds like it in BindingDB:
Activity Spreadsheet -- Enzyme Inhibition Constant Data from BindingDB
Found 1 hit for monomerid = 50434758
TargetBone morphogenetic protein 4(Mus musculus)
Vanderbilt University Medical Center
Curated by ChEMBL
LigandPNGBDBM50434758(CHEMBL2385585)
Affinity DataIC50:  418nM. Assay description: Inhibition of BMP4 in mouse C2C12BRA cells after 14 hrs by luciferase reporter gene assay
In DepthDetails ArticlePubMed