BDBM50434802 CHEMBL2386652
SMILES C[C@@H](O)c1nc2cnc3[nH]ccc3c2n1[C@@H]1CCCOC1
InChI Key InChIKey=VSKQOMHTMYZRLK-NXEZZACHSA-N
Data  1 KI
  Tab Delimited (TSV)   2D SDfile   Computed 3D by Vconf -m prep SDfile
Find this compound or compounds like it in BindingDB:
Activity Spreadsheet -- Enzyme Inhibition Constant Data from BindingDB
Found 1 hit for monomerid = 50434802
TargetTyrosine-protein kinase JAK1(Homo sapiens (Human))
Genentech
Curated by ChEMBL
LigandPNGBDBM50434802(CHEMBL2386652)
Affinity DataKi:  68nM. Assay description: Inhibition of recombinant JAK1 (unknown origin) using Val-Ala-Leu-Val-Asp-Gly-Tyr-Phe-Arg-Leu-Thr-Thr as substrate after 30 mins in presence of ATP
In DepthDetails ArticlePubMed