BDBM50434902 CHEMBL2385224
SMILES CC(C(=O)NCc1ccc(nc1OCCc1ccccc1)C(F)(F)F)c1ccc(NS(C)(=O)=O)c(F)c1
InChI Key InChIKey=XNFPWYWMCYIYGM-UHFFFAOYSA-N
Data  1 KI  1 IC50
  Tab Delimited (TSV)   2D SDfile   Computed 3D by Vconf -m prep SDfile
Find this compound or compounds like it in BindingDB:
Activity Spreadsheet -- Enzyme Inhibition Constant Data from BindingDB
Found 2 hits for monomerid = 50434902
TargetTransient receptor potential cation channel subfamily V member 1(Homo sapiens (Human))
Seoul National University
Curated by ChEMBL
LigandPNGBDBM50434902(CHEMBL2385224)
Affinity DataKi:  0.5nM. Assay description: Antagonist activity at human TRPV1 expressed in CHOK1 cells assessed as inhibition of capsaicin-induced activity by FLIPR assay
In DepthDetails ArticlePubMed
TargetTransient receptor potential cation channel subfamily V member 1(Homo sapiens (Human))
Seoul National University
Curated by ChEMBL
LigandPNGBDBM50434902(CHEMBL2385224)
Affinity DataIC50:  28nMpH: 6.0Assay Description:Antagonist activity at human TRPV1 expressed in CHOK1 cells assessed as inhibition of pH 6 to 6.3-induced activity by FLIPR assay
In DepthDetails ArticlePubMed