BDBM50435159 CHEMBL2392761
SMILES FC(F)(F)c1cc(NC(=O)NC23CC4CC(CC(C4)C2)C3)on1
InChI Key InChIKey=UDTBTAROQFRJDB-UHFFFAOYSA-N
Data  1 IC50
  Tab Delimited (TSV)   2D SDfile   Computed 3D by Vconf -m prep SDfile
Find this compound or compounds like it in BindingDB:
Activity Spreadsheet -- Enzyme Inhibition Constant Data from BindingDB
Found 1 hit for monomerid = 50435159
TargetBifunctional epoxide hydrolase 2(Homo sapiens (Human))
St. Jude Children'S Research Hospital
Curated by ChEMBL
LigandPNGBDBM50435159(CHEMBL2392761)
Affinity DataIC50:  2nM. Assay description: Inhibition of recombinant human soluble epoxide hydrolase using CMNPC as substrate preincubated for 5 mins before substrate addition measured after 1...
In DepthDetails ArticlePubMed