BDBM50435234 CHEMBL2392766
SMILES Cc1nc(nc(SCCc2ccccc2)c1Cl)-c1ccccn1
InChI Key InChIKey=MYCTYVPWNJZLME-UHFFFAOYSA-N
Data  2 IC50
  Tab Delimited (TSV)   2D SDfile   Computed 3D by Vconf -m prep SDfile
Find this compound or compounds like it in BindingDB:
Activity Spreadsheet -- Enzyme Inhibition Constant Data from BindingDB
Found 2 hits for monomerid = 50435234
TargetMethionine aminopeptidase 1(Homo sapiens (Human))
Chinese Academy Of Sciences
Curated by ChEMBL
LigandPNGBDBM50435234(CHEMBL2392766)
Affinity DataIC50:  1.00E+4nM. Assay description: Inhibition of human recombinant full-length cytosolic METAP1 expressed in Escherichia coli BL21(DE3) using Met-Pro-p-nitroanilide as substrate after ...
In DepthDetails ArticlePubMed
TargetMicrotubule-associated protein 2(Homo sapiens (Human))
Chinese Academy Of Sciences
Curated by ChEMBL
LigandPNGBDBM50435234(CHEMBL2392766)
Affinity DataIC50: >1.00E+5nM. Assay description: Inhibition of human recombinant GST-6XHis-tagged full-length cytosolic METAP2 expressed in cabbage looper BTI-TN-5B1-4 cells using Met-Pro-p-nitroani...
In DepthDetails ArticlePubMed