BDBM50435279 CHEMBL2393107
SMILES Cc1cccc(Nc2ccccc2C(=O)NCCCCCC(=O)NCCCCNc2c3CCCCc3nc3cc(Cl)ccc23)c1C
InChI Key InChIKey=XWGBBESHNNQHBU-UHFFFAOYSA-N
Data  2 IC50
  Tab Delimited (TSV)   2D SDfile   Computed 3D by Vconf -m prep SDfile
Find this compound or compounds like it in BindingDB:
Activity Spreadsheet -- Enzyme Inhibition Constant Data from BindingDB
Found 2 hits for monomerid = 50435279
TargetAcetylcholinesterase(Electrophorus electricus (Electric eel))
University Of Michigan
Curated by ChEMBL
LigandPNGBDBM50435279(CHEMBL2393107)
Affinity DataIC50:  37nM. Assay description: Inhibition of electric eel AChE using acetylthiocholine as substrate preincubated for 10 mins prior to substrate addition measured every 30 seconds f...
In DepthDetails ArticlePubMed
TargetAcetylcholinesterase(Electrophorus electricus (Electric eel))
University Of Michigan
Curated by ChEMBL
LigandPNGBDBM50435279(CHEMBL2393107)
Affinity DataIC50:  0.299nM. Assay description: Inhibition of electric eel AChE preincubated for 30 mins prior to horseradish peroxidase, H2O2 and DETAPAC addition measured for 20 mins under ROS co...
In DepthDetails ArticlePubMed