BDBM50435306 CHEMBL2391348
SMILES CC(F)(F)c1ccc(cc1)S(=O)(=O)c1nnn2c3ccsc3c(NCC3CC3)nc12
InChI Key InChIKey=HZAAYXYYNNTFLU-UHFFFAOYSA-N
Data  1 IC50
  Tab Delimited (TSV)   2D SDfile   Computed 3D by Vconf -m prep SDfile
Find this compound or compounds like it in BindingDB:
Activity Spreadsheet -- Enzyme Inhibition Constant Data from BindingDB
Found 1 hit for monomerid = 50435306
TargetUrea transporter 1(Mus musculus)
San Francisco State University
Curated by ChEMBL
LigandPNGBDBM50435306(CHEMBL2391348)
Affinity DataIC50: >800nM. Assay description: Inhibition of UT-B in mouse acetamide-loaded erythrocyte assessed as increase of hypotonic lysis
In DepthDetails ArticlePubMed