BDBM50435355 CHEMBL2391569
SMILES S=C(NCc1cccnc1)Nc1ccccc1
InChI Key InChIKey=QFHALJZCNJGTFQ-UHFFFAOYSA-N
Data  2 IC50
  Tab Delimited (TSV)   2D SDfile   Computed 3D by Vconf -m prep SDfile
Find this compound or compounds like it in BindingDB:
Activity Spreadsheet -- Enzyme Inhibition Constant Data from BindingDB
Found 2 hits for monomerid = 50435355
TargetNicotinamide phosphoribosyltransferase(Homo sapiens (Human))
Forma Therapeutics
Curated by ChEMBL
LigandPNGBDBM50435355(CHEMBL2391569)
Affinity DataIC50: >1.00E+4nM. Assay description: Inhibition of Nampt (unknown origin) using NAM/PRPP as substrate preincubated for 15 mins measured after 30 mins
In DepthDetails ArticlePubMed
TargetUrease(Canavalia ensiformis (Jack bean) (Horse bean))
University Karachi
Curated by ChEMBL
LigandPNGBDBM50435355(CHEMBL2391569)
Affinity DataIC50:  3.35E+4nM. Assay description: Inhibition of jack bean urease using urea as substrate assessed as ammonia production after 15 mins by indophenol method
In DepthDetails ArticlePubMed