BDBM50436047 CHEMBL1233798
SMILES OC(=O)c1[nH]c2cc(Cl)ccc2c1-c1c(ncn1Cc1ccc(Cl)cc1)-c1ccccc1
InChI Key InChIKey=QZJRNGXHRQJBJH-UHFFFAOYSA-N
Data  5 KI
PDB links: 1 PDB ID matches this monomer.
  Tab Delimited (TSV)   2D SDfile   Computed 3D by Vconf -m prep SDfile
Find this compound or compounds like it in BindingDB:
Activity Spreadsheet -- Enzyme Inhibition Constant Data from BindingDB
Found 5 hits for monomerid = 50436047
TargetE3 ubiquitin-protein ligase Mdm2(Homo sapiens (Human))
University Of Utah
Curated by ChEMBL
LigandPNGBDBM50436047(CHEMBL1233798)
Affinity DataKi:  916nM. Assay description: Displacement of fluorescent P4 peptide from recombinant human MDM2 (18 to 125) expressed in Escherichia coli BL21(DE3) RIL expression system after 30...
TargetE3 ubiquitin-protein ligase Mdm2(Homo sapiens (Human))
University Of Utah
Curated by ChEMBL
LigandPNGBDBM50436047(CHEMBL1233798)
Affinity DataKi:  916nM. Assay description: Binding affinity to human MDM2 by fluorescence polarization assay
TargetE3 ubiquitin-protein ligase Mdm2(Homo sapiens (Human))
University Of Utah
Curated by ChEMBL
LigandPNGBDBM50436047(CHEMBL1233798)
Affinity DataKi:  920nM. Assay description: Binding affinity to MDM2 (unknown origin) expressed in Escherichia coli BL21(DE3) after 30 mins by fluorescence polarization assay in presence of P4 ...
TargetE3 ubiquitin-protein ligase Mdm2(Homo sapiens (Human))
University Of Utah
Curated by ChEMBL
LigandPNGBDBM50436047(CHEMBL1233798)
Affinity DataKi:  920nM. Assay description: Competition binding affinity to MDM2 (unknown origin) using p53 mimicking peptide TSFAEYWNLLSP after 30 mins by fluorescence polarization assay
TargetProtein Mdm4(Homo sapiens (Human))
University Of Groningen
Curated by ChEMBL
LigandPNGBDBM50436047(CHEMBL1233798)
Affinity DataKi:  3.60E+4nM. Assay description: Competition binding affinity to MDMX (unknown origin) using p53 mimicking peptide TSFAEYWNLLSP after 30 mins by fluorescence polarization assay
In DepthDetails ArticlePubMed