BDBM50436070 CHEMBL2397215
SMILES COc1ccc(OCC2N(CCc3cc(OC)c(OC)cc23)C(=O)c2cccc(c2)C#N)cc1
InChI Key InChIKey=JHBZLPGNJIGLRO-UHFFFAOYSA-N
Data  2 EC50
  Tab Delimited (TSV)   2D SDfile   Computed 3D by Vconf -m prep SDfile
Find this compound or compounds like it in BindingDB:
Activity Spreadsheet -- Enzyme Inhibition Constant Data from BindingDB
Found 2 hits for monomerid = 50436070
TargetGlutamate receptor ionotropic, NMDA 1/2D(RAT)
Emory University
Curated by ChEMBL
LigandPNGBDBM50436070(CHEMBL2397215)
Affinity DataEC50:  7.70E+3nM. Assay description: Activity at rat recombinant GluN1/GluN2D receptor assessed as potentiation of glycine/glutamate-induced activation by two-electrode voltage clamp tec...
In DepthDetails ArticlePubMed
TargetGlutamate receptor ionotropic, NMDA 1/2C(RAT)
Emory University
Curated by ChEMBL
LigandPNGBDBM50436070(CHEMBL2397215)
Affinity DataEC50:  2.90E+4nM. Assay description: Activity at rat recombinant GluN1/GluN2C receptor assessed as potentiation of glycine/glutamate-induced activation by two-electrode voltage clamp tec...
In DepthDetails ArticlePubMed