BDBM50436105 CHEMBL2397253::US10273214, Example 1180-20
SMILES COc1ccc(OCC2N(CCc3cc(OC)cc(OC)c23)C(=O)c2cccc(Cl)c2)cc1
InChI Key InChIKey=DGEWNXLNJIUWQA-UHFFFAOYSA-N
Data  2 IC50  2 EC50
  Tab Delimited (TSV)   2D SDfile   Computed 3D by Vconf -m prep SDfile
Find this compound or compounds like it in BindingDB:
Activity Spreadsheet -- Enzyme Inhibition Constant Data from BindingDB
Found 4 hits for monomerid = 50436105
TargetGlutamate receptor ionotropic, NMDA 1/2D(RAT)
Emory University
Curated by ChEMBL
LigandPNGBDBM50436105(CHEMBL2397253 | US10273214, Example 1180-20)
Affinity DataEC50:  9.20E+3nM. Assay description: Activity at rat recombinant GluN1/GluN2D receptor assessed as potentiation of glycine/glutamate-induced activation by two-electrode voltage clamp tec...
In DepthDetails ArticlePubMed
TargetGlutamate receptor ionotropic, NMDA 2D(Homo sapiens (Human))
Emory University
US Patent
LigandPNGBDBM50436105(CHEMBL2397253 | US10273214, Example 1180-20)
Affinity DataIC50:  1.80E+4nM
In DepthDetails US Patent
TargetGlutamate receptor ionotropic, NMDA 2C(Homo sapiens (Human))
Emory University
US Patent
LigandPNGBDBM50436105(CHEMBL2397253 | US10273214, Example 1180-20)
Affinity DataIC50:  1.10E+4nM. Assay description: The assay involves using a cell line that expresses the NR1 subunit together with either NR2C or NR2D. These cell lines can be prepared by transfecti...
In DepthDetails US Patent
TargetGlutamate receptor ionotropic, NMDA 1/2C(RAT)
Emory University
Curated by ChEMBL
LigandPNGBDBM50436105(CHEMBL2397253 | US10273214, Example 1180-20)
Affinity DataEC50:  6.10E+3nM. Assay description: Activity at rat recombinant GluN1/GluN2C receptor assessed as potentiation of glycine/glutamate-induced activation by two-electrode voltage clamp tec...
In DepthDetails ArticlePubMed