BDBM50436112 CHEMBL2397453
SMILES COc1ccc(cc1Cc1cc2cccccc2c1)[C@@H]1O[C@H](CO)[C@@H](O)[C@H](O)[C@H]1O
InChI Key InChIKey=QTUDKOOQDHLHDV-SJSRKZJXSA-N
Data  1 IC50
  Tab Delimited (TSV)   2D SDfile   Computed 3D by Vconf -m prep SDfile
Find this compound or compounds like it in BindingDB:
Activity Spreadsheet -- Enzyme Inhibition Constant Data from BindingDB
Found 1 hit for monomerid = 50436112
TargetSodium/glucose cotransporter 2(Homo sapiens (Human))
Astellas Pharmaceutical
Curated by ChEMBL
LigandPNGBDBM50436112(CHEMBL2397453)
Affinity DataIC50:  17nM. Assay description: Inhibition of human SGLT2 expressed in CHO cells assessed as [14C]-methyl-alpha-D-glucopyranoside accumulation
In DepthDetails ArticlePubMed