BDBM50436117 CHEMBL2397443
SMILES Cc1cc(Cc2cccc(c2)[C@@H]2O[C@H](CO)[C@@H](O)[C@H](O)[C@H]2O)c2cccccc12
InChI Key InChIKey=RGUZWHGCTAFVDA-SJSRKZJXSA-N
Data  1 IC50
  Tab Delimited (TSV)   2D SDfile   Computed 3D by Vconf -m prep SDfile
Find this compound or compounds like it in BindingDB:
Activity Spreadsheet -- Enzyme Inhibition Constant Data from BindingDB
Found 1 hit for monomerid = 50436117
TargetSodium/glucose cotransporter 2(Homo sapiens (Human))
Astellas Pharmaceutical
Curated by ChEMBL
LigandPNGBDBM50436117(CHEMBL2397443)
Affinity DataIC50:  4.40E+4nM. Assay description: Inhibition of human SGLT2 expressed in CHO cells assessed as [14C]-methyl-alpha-D-glucopyranoside accumulation
In DepthDetails ArticlePubMed