BDBM50436206 CHEMBL2398567
SMILES CCCCCCCCCCCOC(=O)C1(C)CCc2c(C)c(OCC(O)=O)c(C)c(C)c2O1
InChI Key InChIKey=XLWMEOLIGYXVRQ-UHFFFAOYSA-N
Data  3 IC50  1 EC50
  Tab Delimited (TSV)   2D SDfile   Computed 3D by Vconf -m prep SDfile
Find this compound or compounds like it in BindingDB:
Activity Spreadsheet -- Enzyme Inhibition Constant Data from BindingDB
Found 4 hits for monomerid = 50436206
TargetPresenilin-1(Homo sapiens (Human))
Technische Universit£T Darmstadt
Curated by ChEMBL
LigandPNGBDBM50436206(CHEMBL2398567)
Affinity DataEC50:  5.00E+3nM. Assay description: Modulation of human gamma-secretase presenilin-1 subunit expressed in CHO cells coexpressing human APP assessed as increase in amyloid beta 38 genera...
In DepthDetails ArticlePubMed
TargetPresenilin-1(Homo sapiens (Human))
Technische Universit£T Darmstadt
Curated by ChEMBL
LigandPNGBDBM50436206(CHEMBL2398567)
Affinity DataIC50:  2.30E+4nM. Assay description: Modulation of human gamma-secretase presenilin-1 subunit expressed in CHO cells coexpressing human APP assessed as decrease in amyloid beta 40 genera...
In DepthDetails ArticlePubMed
TargetPresenilin-1(Homo sapiens (Human))
Technische Universit£T Darmstadt
Curated by ChEMBL
LigandPNGBDBM50436206(CHEMBL2398567)
Affinity DataIC50:  3.16E+4nM. Assay description: Modulation of human gamma-secretase presenilin-1 subunit expressed in CHO cells coexpressing human APP assessed as decrease in amyloid beta 42 genera...
In DepthDetails ArticlePubMed
TargetPresenilin-1(Homo sapiens (Human))
Technische Universit£T Darmstadt
Curated by ChEMBL
LigandPNGBDBM50436206(CHEMBL2398567)
Affinity DataIC50:  3.16E+4nM. Assay description: Modulation of human gamma-secretase presenilin-1 subunit expressed in CHO cells coexpressing human APP assessed as decrease in amyloid beta 42 genera...
In DepthDetails ArticlePubMed