BDBM50436324 CHEMBL3037798
SMILES CC(C)C[C@@H]1NC(=O)[C@H](CO)NC(=O)[C@H](CCCCN)NC(=O)[C@@H]2CSSC[C@H](NC(=O)[C@H](C)NC(=O)[C@@H]3CSSC[C@H](NC(=O)[C@H](Cc4ccccc4)NC(=O)[C@H](Cc4cnc[nH]4)NC(=O)[C@H](CC(C)C)NC(=O)[C@H](CC(N)=O)NC(=O)CCSSC[C@H](NC(=O)[C@H](CCCN=C(N)N)NC(=O)CNC(=O)[C@H](CC(C)C)NC(=O)[C@H](CC(C)C)NC(=O)CNC1=O)C(=O)N[C@@H](C)C(=O)N1CCC[C@@H]1C(=O)N[C@@H]([C@@H](C)O)C(=O)N[C@@H](Cc1ccc(OCCS(=O)CCO)cc1)C(=O)N3)C(=O)N[C@@H](CCC(N)=O)C(=O)N[C@@H](CC(C)C)C(=O)N[C@@H](CCCN=C(N)N)C(=O)N2)C(=O)N[C@@H](C(C)C)C(N)=O
InChI Key InChIKey=UOZVVBXEDSMCTI-GUTMBJCZSA-N
Data  1 IC50
  Tab Delimited (TSV)   2D SDfile   Computed 3D by Vconf -m prep SDfile
Find this compound or compounds like it in BindingDB:
Activity Spreadsheet -- Enzyme Inhibition Constant Data from BindingDB
Found 1 hit for monomerid = 50436324
TargetEnvelope glycoprotein gp160(Human immunodeficiency virus type 1 group M subtyp...)
Ibitecs, Cea
Curated by ChEMBL
LigandPNGBDBM50436324(CHEMBL3037798)
Affinity DataIC50:  8.10nM. Assay description: Displacement of soluble CD4 from HIV1 SF162 gp120 after overnight incubation by ELISA
In DepthDetails ArticlePubMed