BDBM50436365 CHEMBL2396716
SMILES OC(=O)COc1cccc(c1)C#Cc1c(oc2cc(O)c(cc12)C(O)=O)-c1ccc(OC(F)(F)F)cc1
InChI Key InChIKey=INKGMUYCBIXDMF-UHFFFAOYSA-N
Data  1 IC50
  Tab Delimited (TSV)   2D SDfile   Computed 3D by Vconf -m prep SDfile
Find this compound or compounds like it in BindingDB:
Activity Spreadsheet -- Enzyme Inhibition Constant Data from BindingDB
Found 1 hit for monomerid = 50436365
TargetTyrosine-protein phosphatase non-receptor type 22(Homo sapiens (Human))
Indiana University School Of Medicine
Curated by ChEMBL
LigandPNGBDBM50436365(CHEMBL2396716)
Affinity DataIC50:  2.50E+3nM. Assay description: Inhibition of N-terminal 6xHis-tagged LYP catalytic domain (1 to 303) (unknown origin) expressed in Escherichia coli BL21(DE3) using pNPP as substrat...
In DepthDetails ArticlePubMed