BDBM50436657 CHEMBL2398288
SMILES CC(N=Nc1nc2ccccc2s1)c1cccc(c1)-c1cncc(n1)C(O)=O
InChI Key InChIKey=RVBDDRFTOKSNHT-UHFFFAOYSA-N
Data  1 IC50
  Tab Delimited (TSV)   2D SDfile   Computed 3D by Vconf -m prep SDfile
Find this compound or compounds like it in BindingDB:
Activity Spreadsheet -- Enzyme Inhibition Constant Data from BindingDB
Found 1 hit for monomerid = 50436657
TargetBcl-2-like protein 1(Homo sapiens (Human))
The Walter And Eliza Hall Institute Of Medical Research
Curated by ChEMBL
LigandPNGBDBM50436657(CHEMBL2398288)
Affinity DataIC50:  3.80E+3nM. Assay description: Binding affinity to human GST-tagged Bcl-Xl by luminescence proximity assay
In DepthDetails ArticlePubMed