BDBM50436728 CHEMBL2402077
SMILES CC[C@H]1N(c2cncnc2)c2nc(ncc2N(C)C1=O)-n1ccnc1-c1ccccc1
InChI Key InChIKey=HKSMOPLPIGGMTK-QGZVFWFLSA-N
Data  3 IC50
  Tab Delimited (TSV)   2D SDfile   Computed 3D by Vconf -m prep SDfile
Find this compound or compounds like it in BindingDB:
Activity Spreadsheet -- Enzyme Inhibition Constant Data from BindingDB
Found 3 hits for monomerid = 50436728
TargetSerine/threonine-protein kinase PLK1(Homo sapiens (Human))
Elan Pharmaceuticals
Curated by ChEMBL
LigandPNGBDBM50436728(CHEMBL2402077)
Affinity DataIC50:  7.76E+3nM. Assay description: Inhibition of GST-tagged Plk1 (unknown origin) assessed as inhibition of DEKTDDED phosphorylation at Thr1342 after 60 mins by TR-FRET assay
In DepthDetails ArticlePubMed
TargetSerine/threonine-protein kinase PLK2(Homo sapiens (Human))
Elan Pharmaceuticals
Curated by ChEMBL
LigandPNGBDBM50436728(CHEMBL2402077)
Affinity DataIC50:  3.87E+3nM. Assay description: Inhibition of Plk2 (unknown origin) transfected in HEK293 cells assessed as inhibition of alpha-synuclein phosphorylation at ser129 after 2 hrs by EL...
In DepthDetails ArticlePubMed
TargetSerine/threonine-protein kinase PLK2(Homo sapiens (Human))
Elan Pharmaceuticals
Curated by ChEMBL
LigandPNGBDBM50436728(CHEMBL2402077)
Affinity DataIC50:  44nM. Assay description: Inhibition of GST-tagged Plk2 (unknown origin) assessed as inhibition of DEKTDDED phosphorylation at Thr1342 after 60 mins by TR-FRET assay
In DepthDetails ArticlePubMed