BDBM50436974 CHEMBL512447
SMILES C[C@@]1(CO)CCC[C@@]2(C)[C@@H]3CC[C@H]4C[C@]3(CC4=C)CC[C@H]12
InChI Key InChIKey=TUJQVRFWMWRMIO-LHYCJURKSA-N
Data  4 IC50
  Tab Delimited (TSV)   2D SDfile   Computed 3D by Vconf -m prep SDfile
Find this compound or compounds like it in BindingDB:
Activity Spreadsheet -- Enzyme Inhibition Constant Data from BindingDB
Found 4 hits for monomerid = 50436974
Target11-beta-hydroxysteroid dehydrogenase type 2(Homo sapiens (Human))
Chinese Academy Of Sciences
Curated by ChEMBL
LigandPNGBDBM50436974(CHEMBL512447)
Affinity DataIC50:  1.00E+4nM. Assay description: Inhibition of human 11beta-HSD2
In DepthDetails ArticlePubMed
Target11-beta-hydroxysteroid dehydrogenase type 2(Mus musculus (mouse))
Chinese Academy Of Sciences
Curated by ChEMBL
LigandPNGBDBM50436974(CHEMBL512447)
Affinity DataIC50: >1.00E+6nM. Assay description: Inhibition of mouse 11beta-HSD2
In DepthDetails ArticlePubMed
Target11-beta-hydroxysteroid dehydrogenase 1(Homo sapiens (Human))
Chinese Academy Of Sciences
Curated by ChEMBL
LigandPNGBDBM50436974(CHEMBL512447)
Affinity DataIC50:  1.42E+3nM. Assay description: Inhibition of human 11beta-HSD1 expressed in HEK293 cell microsomes assessed as inhibition of [3H]cortisone conversion to [3H]cortisol by scintillati...
In DepthDetails ArticlePubMed
Target11-beta-hydroxysteroid dehydrogenase 1(Mus musculus (mouse))
Chinese Academy Of Sciences
Curated by ChEMBL
LigandPNGBDBM50436974(CHEMBL512447)
Affinity DataIC50:  1.55E+3nM. Assay description: Inhibition of mouse 11beta-HSD1 expressed in HEK293 cell microsomes assessed as inhibition of [3H]cortisone conversion to [3H]cortisol by scintillati...
In DepthDetails ArticlePubMed