BDBM50437150 CHEMBL2403820
SMILES CN1CCN(CCC(=O)Nc2ccc3ncnc(Nc4ccc(NC(=O)Nc5cc(nn5-c5cccc(N)c5)C(C)(C)C)cc4)c3c2)CC1
InChI Key InChIKey=SIXVDPYFTBZLMQ-UHFFFAOYSA-N
Data  2 IC50
PDB links: 1 PDB ID matches this monomer.
  Tab Delimited (TSV)   2D SDfile   Computed 3D by Vconf -m prep SDfile
Find this compound or compounds like it in BindingDB:
Activity Spreadsheet -- Enzyme Inhibition Constant Data from BindingDB
Found 2 hits for monomerid = 50437150
TargetProto-oncogene tyrosine-protein kinase Src(Gallus gallus (Chicken))
Technical University Of Dortmund
Curated by ChEMBL
LigandPNGBDBM50437150(CHEMBL2403820)
Affinity DataIC50:  1.10nM. Assay description: Inhibition of chicken wild-type cSRC (251 to 533)-mediated phosphorylation of biotinylated poly-Glu-Tyr expressed in Escherichia coli BL21(DE3) prein...
TargetTyrosine-protein kinase ABL1(Homo sapiens (Human))
Technical University Of Dortmund
Curated by ChEMBL
LigandPNGBDBM50437150(CHEMBL2403820)
Affinity DataIC50:  61nM. Assay description: Inhibition of human wild-type ABL (Ser229 to Gln513)-mediated phosphorylation of biotinylated poly-Glu-Tyr expressed in Escherichia coli BL21(DE3) pr...
In DepthDetails ArticlePubMed