BDBM50437170 CHEMBL2401815
SMILES Nc1ncc2c(coc2c1OCc1c(Cl)ccc(F)c1Cl)-c1cnn(c1)C1CCNCC1
InChI Key InChIKey=SQNBRMRPJYPSFQ-UHFFFAOYSA-N
Data  2 IC50
  Tab Delimited (TSV)   2D SDfile   Computed 3D by Vconf -m prep SDfile
Find this compound or compounds like it in BindingDB:
Activity Spreadsheet -- Enzyme Inhibition Constant Data from BindingDB
Found 2 hits for monomerid = 50437170
TargetHepatocyte growth factor receptor(Homo sapiens (Human))
Osi Pharmaceuticals
Curated by ChEMBL
LigandPNGBDBM50437170(CHEMBL2401815)
Affinity DataIC50: >1.00E+4nM. Assay description: Inhibition of cMET in human MKN45 cells assessed as phosphorylated MET levels after 4 hrs
In DepthDetails ArticlePubMed
TargetHepatocyte growth factor receptor(Homo sapiens (Human))
Osi Pharmaceuticals
Curated by ChEMBL
LigandPNGBDBM50437170(CHEMBL2401815)
Affinity DataIC50:  430nM. Assay description: Inhibition of cMET (unknown origin) using biotinylated poly(Glu,Tyr) as substrate after 60 mins
In DepthDetails ArticlePubMed